{"text_format":"1","workbook":"xlsx","n_sheets":14,"sheets":["Cover","Introduction","Chemotherapy Pathway","Treatment Plan","Pharmacy Capacity","Nurse Capacity","Chair Capacity","drug regimen","Pathway Results","Results Table","Local Assumptions","Pharmacy References","Activity Tariffs","Tariff Information"],"not_rendered":{"charts":0,"images":101,"macros":1,"external_links":0,"defined_names":20,"comments":5,"pivot_tables":0},"unopened":[],"bounds":{"document_bytes":16777216,"sheet_cells":100000,"rows_first":2000,"rows_last":500,"rows_between":2000,"halvings":0,"cell_chars":16384,"cell_head_chars":4096},"cells_cut":0,"cells_raw":0,"read":"whole","date_system":"1900"}

{"sheet":"Cover","index":0,"n_rows":18,"n_cols":4,"rows_kept":18,"cut":false,"hidden":false,"merged":[]}
[]
[]
[]
[]
[]
[]
[]
[]
[]
[]
[]
[]
[]
[]
[]
{"$rows_left_out":4}
{"sheet":"Introduction","index":1,"n_rows":24,"n_cols":4,"rows_kept":24,"cut":false,"hidden":false,"merged":[[23,2,23,10],[14,3,15,13],[1,3,1,9],[7,3,7,9],[17,2,17,10],[18,2,18,10],[19,2,19,10],[20,2,20,10]]}
[]
[null,null,null,"New Drug Capacity Calculator"]
[]
[]
[]
[]
[]
[null,null,null,"Click on the blue buttons below to navigate to the specific page of the New Drug Capacity Calculator."]
[]
[]
[]
[]
[]
[]
[]
{"$rows_left_out":10}
{"sheet":"Chemotherapy Pathway","index":2,"n_rows":64,"n_cols":30,"rows_kept":64,"cut":false,"hidden":false,"merged":[[51,4,51,15],[53,4,53,16],[5,3,7,32],[1,1,1,7],[42,29,42,33],[3,1,3,12],[42,3,44,9],[41,20,41,27],[42,20,42,27],[41,4,41,8],[41,29,41,33],[63,2,63,21],[57,2,57,26],[58,2,58,21],[59,2,59,21],[61,2,61,21],[62,2,62,21]]}
[]
[null,"CHEMOTHERAPY PATHWAY*"]
[]
[null,"For information only, no data input required on this sheet"]
[]
[null,null,null,"The New Drug Capacity Calculator estimates pharmacy capacity (staff  and isolator time), oncology nurse capacity and oncology chair time associated with treating a cohort of patients with a new regimen of cancer drugs"]
[]
[]
[]
[]
[]
[]
[]
[]
[]
{"$rows_left_out":50}
{"sheet":"Treatment Plan","index":3,"n_rows":44,"n_cols":49,"rows_kept":44,"cut":false,"hidden":false,"merged":[[5,5,5,11],[6,5,6,11],[3,7,3,10],[7,34,7,36],[7,43,7,48],[7,7,8,11],[9,29,9,30],[40,5,40,11],[41,7,41,8],[36,7,36,8],[36,5,36,6],[36,9,36,10],[41,9,41,10],[35,9,35,10],[28,7,28,8],[42,7,43,8],[42,5,43,6],[7,2,7,3],[11,3,17,3],[20,3,26,3],[28,2,28,3],[34,5,34,11],[42,9,42,10],[43,9,43,10]]}
[]
[null,null,null,"CALCULATE CHEMOTHERAPY DELIVERY TIME FOR COHORT OF PATIENTS FOR ONE YEAR"]
[]
[null,null,null,null,null,null,null,"Detailed treatment plan (per patient)"]
[]
[null,null,null,null,null,"Step 1: Select, drug type, route, infusion type and times using the drop-down buttons"]
[]
[null,null,"Is Cycle 1 different?",null,null,null,null,"If Cycle 1 is different from subsequent cycles select \"Yes\" and complete Tables 1a and 1b.  \nIf Cycle 1 is the same as subsequent cycles select \"No\" and  complete Table 1b only.\nSelect \"No\" to set the  totals  in Table 1a to zero.\n",null,null,null,null,null,null,null,null,null,null,null,null,null,null,null,null,null,null,null,null,null,null,null,null,null,null,"To be hidden in final version",null,null,null,null,null,null,null,null,"LINKED CELLS"]
[]
[null,null,null,null,null,null,null,null,null,null,null,null,null,null,null,null,null,null,null,null,null,null,null,null,null,null,null,null,null,"To be hidden in final version"]
[null,null,null,null,null,"Table 1a","Drug type","Route","Infusion type","Infusion \ntime (mins)","Observation \ntime (mins)","Administrations \nper cycle",null,null,null,null,null,null,null,null,null,null,null,null,null,null,null,null,null,"Infusion Time","Observation time",null,null,null,"Cycle","Drug Type","Route","Infusion Type","Infusion Time","Observation Time",null,null,null,"Cycle","Drug Type","Route","Infusion Type","Infusion Time","Observation Time"]
[null,null,null,"First Cycle",null,"Drug 1",null,null,null,null,null,1,null,null,null,null,null,null,null,null,null,null,null,null,null,null,null,null,null,{"$f":"IF(AS12=\"Oral\",AV12*0,IF(AS12=\"None\",AV12*0,IF(AS12=\"Select type\",AV12*0,IF(AT12=\"Oral\",AV12*0,IF(AT12=\"None\",AV12*0,IF(AT12=\"Select route\",AV12*0,IF(AU12=\"None\",AV12*0,IF(AU12=\"Select type\",AV12*0,IF(AU12=\"Not Applicable\",AV12*0,AV12)))))))))","v":"60"},{"$f":"IF(AS12=\"None\",AW12*0,IF(AS12=\"Select type\",AW12*0,IF(AT12=\"None\",AW12*0,IF(AT12=\"Select route\",AW12*0,IF(AU12=\"None\",AW12*0,IF(AU12=\"Select type\",AW12*0,AW12))))))","v":"30"},null,null,null,"Yes","Select type","Select route","Select type",0,0,null,null,null,"Yes","MAB","IV Infusion","Infusion bag","60","30"]
[null,null,null,null,null,"Drug 2",null,null,null,null,null,1,null,null,null,null,null,null,null,null,null,null,null,null,null,null,null,null,null,{"$f":"IF(AS13=\"Oral\",AV13*0,IF(AS13=\"None\",AV13*0,IF(AS13=\"Select type\",AV13*0,IF(AT13=\"Oral\",AV13*0,IF(AT13=\"None\",AV13*0,IF(AT13=\"Select route\",AV13*0,IF(AU13=\"None\",AV13*0,IF(AU13=\"Select type\",AV13*0,IF(AU13=\"Not Applicable\",AV13*0,AV13)))))))))","v":"90"},{"$f":"IF(AS13=\"None\",AW13*0,IF(AS13=\"Select type\",AW13*0,IF(AT13=\"None\",AW13*0,IF(AT13=\"Select route\",AW13*0,IF(AU13=\"None\",AW13*0,IF(AU13=\"Select type\",AW13*0,AW13))))))","v":"30"},null,null,null,"No","None","None","None",5,15,null,null,null,"Yes","MAB","IV Infusion","Infusion bag","90","30"]
[null,null,null,null,null,"Drug 3",null,null,null,null,null,0,null,null,null,null,null,null,null,null,null,null,null,null,null,null,null,null,null,0,0,null,null,null,null,"MAB","Oral","Infusion bag",10,30,null,null,null,null,"None","None","None","0","0"]
[null,null,null,null,null,"Drug 4",null,null,null,null,null,0,null,null,null,null,null,null,null,null,null,null,null,null,null,null,null,null,null,0,0,null,null,null,null,"Oral","Sub-cut","Ready made infusion bag",15,45,null,null,null,null,"None","None","None","0","0"]
{"$rows_left_out":30}
{"sheet":"Pharmacy Capacity","index":4,"n_rows":40,"n_cols":37,"rows_kept":40,"cut":false,"hidden":false,"merged":[[3,1,3,8],[9,9,9,11],[36,1,36,5],[30,1,30,5],[35,1,35,5],[6,1,6,2],[24,1,24,2],[32,1,32,2],[16,1,16,2],[11,1,11,2],[6,4,6,8],[11,4,11,8],[16,4,16,8],[24,4,24,8],[32,4,32,8]]}
[]
[null,"CALCULATE PHARMACY CAPACITY"]
[]
[null,"Time in the white box for isolator cleaning time can be changed by overtyping, times in the \"Variable time\" column can be changed using the drop-down buttons. Fixed times and Whole Time Equivalent (WTE) times can be modified by clicking on the hyperlinks below. No other figures should be changed on this sheet."]
[]
[null,"Type of Item/activity","Number of cycles","Quantity for cohort","Fixed time/ item (min)","Variable time /item (min)","Total time \n(hours)","Staff time \n(WTE days)","Isolator time (days)",null,null,null,null,null,null,null,null,null,null,null,null,null,null,null,null,null,null,null,null,null,null,null,"To be Hidden in final model",null,null,null,"Column F "]
[null,"PRESCRIPTION VERIFICATION/REVIEW",null,null,"Step 1 - Select times for prescription verification/review",null,null,null,null,null,null,null,null,null,null,null,null,null,null,null,null,null,null,null,null,null,null,null,null,null,null,null,null,null,null,null,"Linked cells"]
[null,"Cycle 1 prescription verification/review",1,{"$f":"'Treatment Plan'!no_of_patients","v":25},"N/A",null,{"$f":"(D8*AK8)/60","v":6.25},{"$f":"G8/'Local Assumptions'!D31","v":1.1574074074074074},"N/A",null,null,null,null,null,null,null,null,null,null,null,null,null,null,null,null,null,null,null,null,null,null,null,null,null,null,null,"15"]
[null,"Subsequent cycles prescription verification/review",{"$f":"'Treatment Plan'!planned_cycle-1","v":17},{"$f":"'Treatment Plan'!planned_cycle*'Treatment Plan'!no_of_patients-'Pharmacy Capacity'!D8","v":425},"N/A",null,{"$f":"(D9*AK9)/60","v":56.666666666666664},{"$f":"G9/'Local Assumptions'!D31","v":10.493827160493826},"N/A",null,null,null,null,null,null,null,null,null,null,null,null,null,null,null,null,null,null,null,null,null,null,"Prescription and checks","Manufacturing",null,null,null,"8"]
[null,"TOTAL TIME FOR PRESCRIPTION VERIFICATION/ REVIEW FOR THE COHORT",null,null,null,null,{"$f":"IF('Treatment Plan'!$J$44=0,0,(SUM('Pharmacy Capacity'!G8:G9)))","v":62.916666666666664},{"$f":"IF('Treatment Plan'!$J$44=0,0,(SUM('Pharmacy Capacity'!H8:H9)))","v":11.651234567901234},null,null,null,null,null,null,null,null,null,null,null,null,null,null,null,null,null,null,null,null,null,null,null,0,0]
[null,null,null,null,null,null,null,null,null,null,null,null,null,null,null,null,null,null,null,null,null,null,null,null,null,null,null,null,null,null,null,1,5]
[null,"ADDITIONAL CHECKS",null,null,"Step 2 - Select time for additional checks",null,null,null,null,null,null,null,null,null,null,null,null,null,null,null,null,null,null,null,null,null,null,null,null,null,null,2,10]
[null,"Check blood tests",{"$f":"'Treatment Plan'!planned_cycle","v":18},{"$f":"'Treatment Plan'!planned_cycle*'Treatment Plan'!no_of_patients","v":450},"N/A",null,{"$f":"(D13*AK13)/60","v":0},{"$f":"G13/'Local Assumptions'!D31","v":0},"N/A",null,null,null,null,null,null,null,null,null,null,null,null,null,null,null,null,null,null,null,null,null,null,3,15,null,null,null,"0"]
[null,"Other checks",{"$f":"'Treatment Plan'!planned_cycle","v":18},{"$f":"'Treatment Plan'!planned_cycle*'Treatment Plan'!no_of_patients","v":450},"N/A",null,{"$f":"(D14*AK14)/60","v":0},{"$f":"G14/'Local Assumptions'!D31","v":0},"N/A",null,null,null,null,null,null,null,null,null,null,null,null,null,null,null,null,null,null,null,null,null,null,5,25,null,null,null,"0"]
[null,"TOTAL TIME FOR ADDITIONAL CHECKS FOR COHORT",null,null,null,null,{"$f":"IF('Treatment Plan'!$J$44=0,0,(SUM('Pharmacy Capacity'!G13:G14)))","v":0},{"$f":"IF('Treatment Plan'!$J$44=0,0,(SUM('Pharmacy Capacity'!H13:H14)))","v":0},null,null,null,null,null,null,null,null,null,null,null,null,null,null,null,null,null,null,null,null,null,null,null,6,30]
{"$rows_left_out":26}
{"sheet":"Nurse Capacity","index":5,"n_rows":40,"n_cols":37,"rows_kept":40,"cut":false,"hidden":false,"merged":[[44,1,44,3],[11,1,11,3],[13,1,13,2],[37,1,37,2],[38,1,38,3],[23,1,23,2],[23,3,23,5],[18,1,18,2],[18,3,18,5],[13,3,13,5],[28,7,28,9],[39,1,39,3],[43,1,43,3],[3,1,3,5],[36,1,36,5],[31,1,31,5],[32,3,32,5],[6,3,6,5],[21,1,21,2],[16,1,16,3],[6,1,6,2],[32,1,32,2]]}
[]
[null,"CALCULATE NURSE CAPACITY"]
[]
[null,"Times in the \"Time/cycle/patient\" column can be changed using the drop-down buttons.  Whole Time Equivalent  (WTE) times can be modified by clicking on the hyperlink below. No other figures should be changed on this sheet."]
[]
[null,"Type of Item/activity","Quantity/patient","Time /cycle/patient for regimen (min)","Total time for cohort (hours)","Staff resource\n (WTE days)",null,null,null,null,null,null,null,null,null,null,null,null,null,null,null,null,null,null,null,null,"Select type","Infusion bag","Syringe","Ready made syringes",null,"To be hidden in final version",null,null,null,null,"Column D"]
[null,"CLINICAL REVIEW (NOT INCLUDED IN CHAIR TIME)",null,"    Step 1  - Select times for the following clinical review activities",null,null,null,null,null,null,null,null,null,null,null,null,null,null,null,null,null,null,null,null,null,null,null,null,null,null,null,"Checks and Prep times","Drug admin times",null,null,null,"Linked cells"]
[null,"Check blood tests","N/A",null,{"$f":"(AK8*'Treatment Plan'!planned_cycle*'Treatment Plan'!no_of_patients)/60","v":37.5},{"$f":"E8/'Local Assumptions'!$D$31","v":6.9444444444444438},null,null,null,null,null,null,null,null,null,null,null,null,null,null,null,null,null,null,null,null,null,null,null,null,null,0,0,null,null,null,"5"]
[null,"Administrative tasks","N/A",null,{"$f":"(AK9*'Treatment Plan'!planned_cycle*'Treatment Plan'!no_of_patients)/60","v":75},{"$f":"E9/'Local Assumptions'!$D$31","v":13.888888888888888},null,null,null,null,null,null,null,null,null,null,null,null,null,null,null,null,null,null,null,null,null,null,null,null,null,5,1,null,null,null,"10"]
[null,"Pre-chemo assessment","N/A",null,{"$f":"(AK10*'Treatment Plan'!planned_cycle*'Treatment Plan'!no_of_patients)/60","v":75},{"$f":"E10/'Local Assumptions'!$D$31","v":13.888888888888888},null,null,null,null,null,null,null,null,null,null,null,null,null,null,null,null,null,null,null,null,null,null,null,null,null,10,2,null,null,null,"10"]
[null,"Other clinical assessments","N/A",null,{"$f":"(AK11*'Treatment Plan'!planned_cycle*'Treatment Plan'!no_of_patients)/60","v":37.5},{"$f":"E11/'Local Assumptions'!$D$31","v":6.9444444444444438},null,null,null,null,null,null,null,null,null,null,null,null,null,null,null,null,null,null,null,null,null,null,null,null,null,15,3,null,null,null,"5"]
[null,"Total times for clinical review ",null,null,{"$f":"IF('Treatment Plan'!$J$44=0,0,(SUM(E8:E11)))","v":225},{"$f":"IF('Treatment Plan'!$J$44=0,0,(SUM(F8:F11)))","v":41.666666666666664},null,null,null,null,null,null,null,null,null,null,null,null,null,null,null,null,null,null,null,null,null,null,null,null,null,20,4]
[null,null,null,null,null,null,null,null,null,null,null,null,null,null,null,null,null,null,null,null,null,null,null,null,null,null,null,null,null,null,null,25,5]
[null,"ADDITIONAL CHECKS/PREPARATION (NOT INCLUDED IN CHAIR TIME)",null,"    Step 2 - Select combined time for activities",null,null,null,null,null,null,null,null,null,null,null,null,null,null,null,null,null,null,null,null,null,null,null,null,null,null,null,30,6]
[null,"Cycle 1","N/A",null,{"$f":"IF('Treatment Plan'!$AR$12=\"No\",0,(AK15*'Treatment Plan'!no_of_patients)/60)","v":0},{"$f":"E15/'Local Assumptions'!D31","v":0},null,null,null,null,null,null,null,null,null,null,null,null,null,null,null,null,null,null,null,null,null,null,null,null,null,45,8,null,null,null,"0"]
{"$rows_left_out":26}
{"sheet":"Chair Capacity","index":6,"n_rows":24,"n_cols":4,"rows_kept":24,"cut":false,"hidden":false,"merged":[[3,2,3,3],[18,2,18,3],[23,2,23,4]]}
[]
[null,null,"ESTIMATE OF CHAIR CAPACITY"]
[]
[null,null,"Summary of treatment plan "]
[null,null,"Drug Type","Items to administer"]
[null,null,"Oral",{"$f":"'Nurse Capacity'!C25","v":0}]
[null,null,"Sub-cut",{"$f":"'Nurse Capacity'!C26","v":0}]
[null,null,"Intramuscular",{"$f":"'Nurse Capacity'!C27","v":0}]
[null,null,"IV bolus",{"$f":"'Nurse Capacity'!C28","v":0}]
[null,null,"IV infusion",{"$f":"'Nurse Capacity'!C29","v":2}]
[null,null,"Intrathecal",{"$f":"'Nurse Capacity'!C30","v":0}]
[]
[null,null,"Number of patients",{"$f":"'Treatment Plan'!no_of_patients","v":25}]
[null,null,"Total time from treatment plan (hours)",{"$f":"'Treatment Plan'!J43","v":937.5}]
[null,null,"Nurse led activities (hours)*",{"$f":"'Nurse Capacity'!E22+'Nurse Capacity'!E31","v":0}]
{"$rows_left_out":10}
{"sheet":"drug regimen","index":7,"n_rows":47,"n_cols":11,"rows_kept":47,"cut":false,"hidden":true,"merged":[[33,5,33,10],[41,5,41,10],[3,5,3,10],[12,5,12,10],[3,0,3,4]]}
[]
["Clinical Protocol:",null,null,null,"XELOX (Oxaliplatin and Capecitabine ) + Cetuximab (Oxaliplatin and Cetuximab - 2hr infusions and Capecitabine as oral) "]
[]
["SW: is 3 drugs typical? More?",null,null,null,null,"Choose Drugs: Route & Recommended Infusion Time"]
[]
[null,null,null,null,null,null,null,"Route","Infusion time or regimen","Route","Infusion Time"]
[null,null,null,null,null,"Drug 1","Cetuximab","oral","N/A","IV"]
[null,null,null,null,null,null,"(a mab)","IV bolus","N/A"]
[null,null,null,null,null,null,null,"IV subcut","N/A"]
[null,null,null,null,null,null,null,"IV","60 mins"]
[null,null,null,null,null,null,null,null,"120mins"]
[]
[]
[null,null,null,null,null,null,null,null,"180 mins"]
[null,null,null,null,null,null,null,null,"240 mins"]
{"$rows_left_out":33}
{"sheet":"Pathway Results","index":8,"n_rows":67,"n_cols":34,"rows_kept":67,"cut":false,"hidden":false,"merged":[[54,3,54,14],[56,3,56,15],[44,3,44,7],[46,3,46,7],[44,29,44,32],[46,8,46,9],[45,8,45,9],[45,29,45,32],[4,3,6,32],[41,4,43,8],[40,26,40,27],[41,20,43,27],[44,8,44,9],[41,29,43,33],[40,29,40,33],[66,1,66,20],[60,1,60,26],[61,1,61,20],[62,1,62,20],[64,1,64,20],[65,1,65,20]]}
[]
[null,"CHEMOTHERAPY PATHWAY - CAPACITY REQUIRED*"]
[]
[]
[null,null,null,"This page presents the results of this capacity estimate (pharmacy capacity (WTE and isolator time), oncology nurse capacity and oncology chair time associated with delivery of the regimen you have detailed for the cohort of interest)."]
[]
[]
[]
[]
[]
[]
[]
[]
[]
[]
{"$rows_left_out":53}
{"sheet":"Results Table","index":9,"n_rows":14,"n_cols":8,"rows_kept":14,"cut":false,"hidden":false,"merged":[[6,2,6,7],[13,2,13,3]]}
[]
[]
[]
[null,"RESULTS TABLE"]
[]
[]
[null,null,"Enter the Title of the New Chemotherapy Regimen"]
[]
[null,null,null,"Staff Resource\n (WTE days)","Staff Resource          (WTE equivalent)","Isolator Time\n(days)","Chair Time\n(days)","Chair Time\nHours Per week"]
[null,null,"PHARMACY",{"$f":"'Pharmacy Capacity'!H36","v":189.43168724279832},{"$f":"D10/365","v":0.51899092395287205},{"$f":"'Pharmacy Capacity'!I36","v":128.00192592592592},"N/A","N/A"]
[null,null,"NURSE",{"$f":"'Nurse Capacity'!F39","v":70.216049382716051},{"$f":"D11/365","v":0.19237273803483851},"N/A","N/A","N/A"]
[null,null,"FACILITIES","N/A","N/A","N/A",{"$f":"'Chair Capacity'!D21","v":125},{"$f":"G12/52*7.5","v":18.028846153846153}]
[null,null,"TOTAL",{"$f":"SUM(D10:D12)","v":259.64773662551437},0.71136366198771062,{"$f":"SUM(F10:F12)","v":128.00192592592592},{"$f":"SUM(G12)","v":125},{"$f":"SUM(H12)","v":18.028846153846153}]
[null,null,"WTE = Whole Time Equivalent"]

{"sheet":"Local Assumptions","index":10,"n_rows":31,"n_cols":5,"rows_kept":31,"cut":false,"hidden":false,"merged":[[6,1,6,2],[7,1,7,2],[9,1,9,2],[30,4,30,6]]}
[]
[]
[null,"LOCAL ASSUMPTIONS "]
[]
[]
[null,null,null,"Available time (hours)"]
[null,"Average opening time for chemotherapy unit",null,7.5]
[]
[]
[null,"Average opening time for pharmacy unit",null,7.5]
[]
[]
[null,"Fixed time for pharmacy staff"]
[null,"Assistants",null,27.3]
[null,"Pharmacists",null,27.3]
{"$rows_left_out":17}
{"sheet":"Pharmacy References","index":11,"n_rows":45,"n_cols":6,"rows_kept":45,"cut":false,"hidden":false,"merged":[[1,1,1,5],[44,1,46,5]]}
[]
[null,"GUIDANCE ON FIXED TIMES FOR PHARMACY*"]
[]
[null,"Time taken per infusion (mins)"]
[null,"Task","Assistant","Technician","Pharmacist","Total"]
[null,"Clinical Check",null,null,5,{"$f":"SUM(C6:E6)","v":5}]
[null,"Workhseet & labels",null,10,null,{"$f":"SUM(C7:E7)","v":10}]
[null,"Setting Up",5,null,null,{"$f":"SUM(C8:E8)","v":5}]
[null,"Checking Ingredients",null,2,null,{"$f":"SUM(C9:E9)","v":2}]
[null,"Transfer",5,null,null,5]
[null,"Labelling, Final Check, Release",null,null,5,5]
[null,"Delivery",2,null,null,2]
[null,"TOTAL (mins)",{"$f":"SUM(C6:C12)","v":12},{"$f":"SUM(D6:D12)","v":12},{"$f":"SUM(E6:E12)","v":10},{"$f":"SUM(F6:F12)","v":34}]
[]
[null,"Time taken per syringe (mins)"]
{"$rows_left_out":31}
{"sheet":"Activity Tariffs","index":12,"n_rows":45,"n_cols":34,"rows_kept":45,"cut":false,"hidden":false,"merged":[[29,0,32,0],[2,1,2,6],[42,1,42,3],[44,1,44,3],[32,1,32,3],[38,1,38,4],[40,1,40,3],[4,1,6,7],[34,1,34,3],[34,4,34,6],[35,1,35,3],[35,4,35,6]]}
[]
[]
[null,"UNBUNDLED HRGs FOR CHEMOTHERAPY DELIVERY FOR REGIMENS ON THE NATIONAL LIST*"]
[]
[null,"This sheet generates the likely tariff costs for delivering unbundled HRGs for chemotherapy delivery for regimens on the national list. If the chemotherapy regimen being delivered is not on the national list, this sheet will not apply and please use code SB17Z and local tariff information. "]
[]
[]
[]
[]
[null,"All oral regimen - Tariff for cohort"]
[null,null,null,"HRG4 Code ","Total tariff for cohort (£)",null,null,null,null,null,null,null,null,null,null,null,null,null,null,null,null,null,null,null,null,null,"Selection",null,null,null,null,"Linked Cells"]
["Step 1","Is the  regimen exclusively oral chemotherapy?",null,{"$f":"IF(AF12=\"Yes\",\"SB11Z\",\"Go to Step 2\")","v":"Go to Step 2"},{"$f":"IF(AF12=\"Yes\",'Tariff Information'!D5*'Treatment Plan'!planned_cycle*'Treatment Plan'!no_of_patients,\"Go to Step 2\")","v":"Go to Step 2"},null,null,null,null,null,null,"PREVIOUS",null,null,null,null,null,null,null,null,null,null,null,null,null,null,"Yes",null,null,null,null,"No"]
[null,null,"If yes, the following steps do not apply",null,null,null,null,null,null,null,null,"No",null,null,null,null,null,null,null,null,null,null,null,null,null,null,"No"]
[null,"Parenteral -Tariff for Cycle 1 cohort"]
[]
{"$rows_left_out":31}
{"sheet":"Tariff Information","index":13,"n_rows":16,"n_cols":4,"rows_kept":16,"cut":false,"hidden":false,"merged":[[12,1,12,3],[13,1,13,3],[14,1,14,3]]}
[]
[null,"DETAILS OF CHEMOTHERAPY COSTS (from the National tariff payment system 2018/19 - Annex A Spreadsheet Tab,  4c Unbundled prices 18.19)"]
[]
[null,"HRG code","HRG name","Tariff (£)"]
[null,"SB11Z","Deliver Exclusively Oral Chemotherapy",120]
[null,"SB12Z","Deliver Simple Parenteral Chemotherapy at first attendance",150]
[null,"SB13Z","Deliver more Complex Parenteral Chemotherapy at first attendance",299]
[null,"SB14Z","Deliver Complex Chemotherapy, including Prolonged Infusion Treatment at first attendance",449]
[null,"SB15Z","Deliver Subsequent Elements of a Chemotherapy Cycle",299]
[null,"SB17Z","Deliver Chemotherapy for Regimens not on the National List","-"]
[]
[]
[]
[null,"Reference 2017/18 and 2018/19 National Tariff Payment System, Available at \n\n"]
[null,"https://improvement.nhs.uk/resources/national-tariff-1719/"]
{"$rows_left_out":1}